{"text_format":"3","workbook":"xlsx","n_sheets":5,"sheets":["Ratenberechnung","Kurzberechnung","Details","Mehrbedarf","Werte"],"not_rendered":{"defined_names":4,"comments":4},"read":"whole","date_system":"1900"}

{"sheet":"Ratenberechnung","index":0,"n_rows":127,"n_cols":18,"rows_kept":127}
["Anlage PKH/VKH-Berechnung",{"$nulls":4},{"$f":"TODAY()","v":"2025-12-29"},null,{"$f":"$F$67","v":{"v":0,"d":"0.00 €"}}]
["Wohnsitz für Freibeträge:",null,"Az.:",{"$f":"IF(Kurzberechnung!D1=\"\",\"\",Kurzberechnung!D1)","v":""},{"$nulls":3},"Freibeträge etc. ab 01.01.2026",{"$nulls":9},1]
[]
["I. Einkünfte",null,null,"Einkommen (ggf. siehe Detailsseite)",{"v":0,"d":"0.00 €"},{"$f":"SUM(E4:E6)/B7","v":{"v":0,"d":"0.00 €"}},null,"Bitte nur Daten in die "]
["   Werte für:",null,null,"sonstige Einnahmen",{"v":0,"d":"0.00 €"},null,null,"grauen Felder eintragen!"]
[{"$nulls":3},"Weihnachts-/ Urlaubsgeld (umgelegt)",{"v":0,"d":"0.00 €"}]
[null,1,5,{"$f":"IF(F65=1,\"Kindergeld\",\"\")","v":"Kindergeld"},{"$f":"IF(F65=1,(IF(B64<3,B64*H88,(IF(B64=3,(H88*2+H89),(H88*2+H89)+(B64-3)*H90)))),\"\")","v":{"v":0,"d":"0.00 €"}},{"$f":"E7","v":{"v":0,"d":"0.00 €"}},null,"Kostenvoranschlag gem. DB-PKH:"]
[]
["II. Abzüge gemäß § 82 II SGB XII",null,null,"Lohnsteuer",{"v":0,"d":"0.00 €"},{"$f":"SUM(E9:E16)/B16","v":{"v":0,"d":"0.00 €"}},null,null,12]
["   Werte für:",null,null,"Solidaritätszuschlag",{"v":0,"d":"0.00 €"}]
[{"$nulls":3},"Kirchensteuer",{"v":0,"d":"0.00 €"},null,null,"Streit-/Verfahrenswert:"]
[{"$nulls":3},"Rentenversicherung",{"v":0,"d":"0.00 €"},null,null,{"v":3000,"d":"3,000.00 €"}]
[{"$nulls":3},"Krankenversicherung (auch Zusatz-)",{"v":0,"d":"0.00 €"}]
[{"$nulls":3},"Arbeitslosenversicherung",{"v":0,"d":"0.00 €"},null,null,"voraussichtliche Kosten:"]
[{"$nulls":3},"Pflegeversicherung",{"v":0,"d":"0.00 €"},null,null,{"$f":"VLOOKUP(H12,Werte!B98:S139,MATCH(Ratenberechnung!I9,Werte!C97:S97,0)+1,TRUE)","v":{"v":923,"d":"923.00 €"}}]
[null,1,null,"Gewerbesteuer",{"v":0,"d":"0.00 €"}]
["II.a sonstige Abzüge",null,null,"Beiträge Gewerkschaft/Berufsverband",{"v":0,"d":"0.00 €"},{"$f":"SUM(E17:E24)","v":{"v":0,"d":"0.00 €"}},null,"zu zahlen sind:"]
["   (Werte für 1 Monat)",null,null,"Rundfunkbeitrag",{"$f":"IF(G18>1,Werte!C25/(G18-1),0)","v":{"v":0,"d":"0.00 €"}},null,{"v":1,"d":"1.00 DM"},{"$f":"IF(H1>0,(IF(H1>H15,\"alle Kosten in einer Rate\",I18&\" Rate(n) und \"&(H15-(I18*H1))&\" €\")),\"keine Raten\")","v":"keine Raten"},{"$f":"IF(H1>0,(ROUNDDOWN(H15/H1,0)),0)","v":0}]
[{"$nulls":3},"Hausrat- /Haftpflichtversicherung",{"v":0,"d":"0.00 €"},null,null,{"$f":"IF(I18>47,\"Es sind pro Verfahren jedoch nur\",\"\")","v":""}]
[{"$nulls":3},"sonst. angemessene Risikoversicherungen",{"$f":"Kurzberechnung!E8","v":{"v":0,"d":"0.00 €"}},null,null,{"$f":"IF(I18>47,\"maximal 48 Raten zu zahlen (§ 115 II 4 ZPO)\",\"\")","v":""}]
[{"$nulls":3},"geförderte Altersvorsorge",{"v":0,"d":"0.00 €"},null,null,{"$f":"IF(AND(H1>0,H15<=(H1*4)),\"(Kosten ≤ 4 Raten, § 115 IV ZPO beachten)\",\"\")","v":""}]
[null,null,{"$f":"Kurzberechnung!C9","v":0},"km Entf. zur Arbeit (5,20 € /km)¹",{"$f":"C22*5.2","v":{"v":0,"d":"0.00 €"}}]
[{"$nulls":3},"Monatskarte ÖPNV",{"$f":"Kurzberechnung!E10","v":{"v":0,"d":"0.00 €"}}]
[{"$nulls":3},"sonstige Werbungskosten/Kinderbetreuung",{"$f":"Kurzberechnung!E11","v":{"v":0,"d":"0.00 €"}}]
["Nettoeinkommen",{"$nulls":4},{"$f":"F4-F9-F17+(IF(F65=1,F7,0))","v":{"v":0,"d":"0.00 €"}}]
[]
["III. Erwerbstätigenfreibetrag § 115 I Nr. 1 b",{"$nulls":3},1,{"$f":"IF(E27=1,I83,0)","v":{"v":282,"d":"282.00 €"}}]
[]
[]
["IV. Freibeträge nach § 115 I ZPO",null,null,2,null,{"$f":"VLOOKUP(D30,H84:I86,2)","v":{"v":54.82,"d":"54.82 €"}}]
[]
[null,1,"Ehegatte/","Einkommen",{"$f":"Kurzberechnung!E18","v":{"v":0,"d":"0.00 €"}},{"$f":"IF(B32>1,IF(E33=0,Q32,E33),0)","v":{"v":0,"d":"0.00 €"}},{"$nulls":7},{"$f":"IF(B32=2,I83,0)","v":0},{"$f":"IF(E32-IF(B32=2,N32)>0,E32-IF(B32=2,N32),0)","v":{"v":0,"d":"0.00 €"}},{"$f":"I84","v":619},{"$f":"IF(P32-O32>0,P32-O32,0)","v":619}]
[null,null,"eingetr. LP:","von PKH-Partei gezahlter Unterhalt",{"$f":"Kurzberechnung!E19","v":{"v":0,"d":"0.00 €"}}]
[]
[null,1,"1. Person:","Einkommen /Unterhalt v. anderer Person",{"$f":"Kurzberechnung!E21","v":{"v":0,"d":"0.00 €"}},{"$f":"IF(B35>1,IF(E36=0,Q36,E36),0)","v":{"v":0,"d":"0.00 €"}},{"$nulls":4},"Kind für KiGe?","Kindergeld?","KiGe-Betrag","Freibetrag für Erwerbstätigkeit","Einkommen real","Freibetrag","verbleibender Freibetrag"]
[{"$nulls":3},"von PKH-Partei gezahlter Unterhalt",{"$f":"Kurzberechnung!E22","v":{"v":0,"d":"0.00 €"}},{"$nulls":5},{"$f":"IF(B35>1,L36-1,0)","v":0},1,{"$f":"IF(AND(F65=2,L36=2),H88,0)","v":{"v":0,"d":"0.00 €"}},{"$f":"IF(OR(B35=2,B35=3),I83,0)","v":0},{"$f":"IF(E35-IF(OR(B35=2,B35=3),N36)>0,E35-IF(OR(B35=2,B35=3),N36),0)","v":{"v":0,"d":"0.00 €"}},{"$f":"LOOKUP(B35,H76:H82,I76:I82)","v":0},{"$f":"IF(P36-M36-O36>0,P36-M36-O36,0)","v":0}]
[]
[null,1,"2. Person: ","Einkommen /Unterhalt v. anderer Person",{"$f":"Kurzberechnung!E24","v":{"v":0,"d":"0.00 €"}},{"$f":"IF(B38>1,IF(E39=0,Q39,E39),0)","v":{"v":0,"d":"0.00 €"}}]
[{"$nulls":3},"von PKH-Partei gezahlter Unterhalt",{"$f":"Kurzberechnung!E25","v":{"v":0,"d":"0.00 €"}},{"$nulls":5},{"$f":"IF(B38>1,L39-1,0)","v":0},1,{"$f":"IF(AND(F65=2,L39=2),H88,0)","v":{"v":0,"d":"0.00 €"}},{"$f":"IF(OR(B38=2,B38=3),I83,0)","v":0},{"$f":"IF(E38-IF(OR(B38=2,B38=3),N39)>0,E38-IF(OR(B38=2,B38=3),N39),0)","v":{"v":0,"d":"0.00 €"}},{"$f":"LOOKUP(B38,H76:H82,I76:I82)","v":0},{"$f":"IF(P39-M39-O39>0,P39-M39-O39,0)","v":0}]
[]
{"$rows_left_out":88}
{"sheet":"Kurzberechnung","index":1,"n_rows":89,"n_cols":16,"rows_kept":89,"hidden":true}
["Anlage",null,"Az.:",null,null,{"$f":"TODAY()","v":"2025-12-29"}]
["PKH/VKH-Kurzberechnung",{"$nulls":4},{"$f":"Ratenberechnung!F2","v":0}]
[]
["Einkommen",null,null,"Nettoeinkommen (ggf. siehe Detailsseite)",{"$f":"IF(Details!F17=\"\",0,Details!F17)","v":{"v":0,"d":"0.00 €"}},{"$f":"IF(B6=FALSE,SUM(E4:E6),(SUM(E4:E6)/12))","v":{"v":0,"d":"0.00 €"}}]
[null,null,5]
[null,false,null,{"$f":"IF(F40=1,\"Kindergeld\",\"\")","v":""},{"$f":"IF(F40=1,(IF(B39<3,B39*G87,(IF(B39=3,(G87*2+G88),(G87*2+G88)+(B39-3)*G89)))),0)","v":{"v":0,"d":"0.00 €"}}]
[]
[{"$nulls":3},"angemessene Risikoversicherungen",{"v":0,"d":"0.00 €"},{"$f":"SUM(E8:E11)","v":{"v":0,"d":"0.00 €"}}]
[null,null,0,"km Entf. zur Arbeit (5,20 € /km)¹",{"$f":"C9*5.2","v":{"v":0,"d":"0.00 €"}}]
[{"$nulls":3},"Monatskarte ÖPNV",{"v":0,"d":"0.00 €"}]
[{"$nulls":3},"sonstige Werbungskosten",{"v":0,"d":"0.00 €"}]
[{"$nulls":5},{"$f":"F4-F8","v":{"v":0,"d":"0.00 €"}}]
[]
["Abzüge",{"$nulls":3},1,{"$f":"IF(E14=1,H82,0)","v":{"v":282,"d":"282.00 €"}}]
[]
[{"$nulls":3},1,null,{"$f":"VLOOKUP(D16,G83:H85,2)","v":{"v":619,"d":"619.00 €"}}]
[]
[null,1,"Ehegatte/","Einkommen",{"v":0,"d":"0.00 €"},{"$f":"IF(B18>1,IF(E19=0,P18,E19),0)","v":{"v":0,"d":"0.00 €"}},{"$nulls":6},{"$f":"IF(B18=2,H82,0)","v":0},{"$f":"IF(E18-IF(B18=2,M18)>0,E18-IF(B18=2,M18),0)","v":{"v":0,"d":"0.00 €"}},{"$f":"H83","v":619},{"$f":"IF(O18-N18>0,O18-N18,0)","v":619}]
[null,null,"eingetr. LP:","von PKH-Partei gezahlter Unterhalt",{"v":0,"d":"0.00 €"}]
[{"$nulls":9},"Kind für KiGe?","Kindergeld?","KiGe-Betrag","Freibetrag für Erwerbstätigkeit","Einkommen real","Freibetrag","verbleibender Freibetrag"]
[null,1,"1. Person:","Einkommen /Unterhalt v. anderer Person",{"v":0,"d":"0.00 €"},{"$f":"IF(B21>1,IF(E22=0,P21,E22),0)","v":{"v":0,"d":"0.00 €"}},{"$nulls":3},{"$f":"IF(B21>1,K21-1,0)","v":0},1,{"$f":"IF(AND(K21=2,F40=2),G87,0)","v":{"v":0,"d":"0.00 €"}},{"$f":"IF(OR(B21=2,B21=3),H82,0)","v":0},{"$f":"IF(E21-IF(OR(B21=2,B21=3),M21)>0,E21-IF(OR(B21=2,B21=3),M21),0)","v":{"v":0,"d":"0.00 €"}},{"$f":"LOOKUP(B21,G75:G81,H75:H81)","v":0},{"$f":"IF(O21-N21-L21>0,O21-N21-L21,0)","v":0}]
[{"$nulls":3},"von PKH-Partei gezahlter Unterhalt",{"v":0,"d":"0.00 €"}]
[]
[null,1,"2. Person: ","Einkommen /Unterhalt v. anderer Person",{"v":0,"d":"0.00 €"},{"$f":"IF(B24>1,IF(E25=0,P24,E25),0)","v":{"v":0,"d":"0.00 €"}},{"$nulls":3},{"$f":"IF(B24>1,K24-1,0)","v":0},1,{"$f":"IF(AND(K24=2,F40=2),G87,0)","v":{"v":0,"d":"0.00 €"}},{"$f":"IF(OR(B24=2,B24=3),H82,0)","v":0},{"$f":"IF(E24-IF(OR(B24=2,B24=3),M24)>0,E24-IF(OR(B24=2,B24=3),M24),0)","v":{"v":0,"d":"0.00 €"}},{"$f":"LOOKUP(B24,G75:G81,H75:H81)","v":0},{"$f":"IF(O24-N24-L24>0,O24-N24-L24,0)","v":0}]
[{"$nulls":3},"von PKH-Partei gezahlter Unterhalt",{"v":0,"d":"0.00 €"}]
[]
[null,1,"3. Person: ","Einkommen /Unterhalt v. anderer Person",{"v":0,"d":"0.00 €"},{"$f":"IF(B27>1,IF(E28=0,P27,E28),0)","v":{"v":0,"d":"0.00 €"}},{"$nulls":3},{"$f":"IF(B27>1,K27-1,0)","v":0},1,{"$f":"IF(AND(K27=2,F40=2),G88,0)","v":{"v":0,"d":"0.00 €"}},{"$f":"IF(OR(B27=2,B27=3),H82,0)","v":0},{"$f":"IF(E27-IF(OR(B27=2,B27=3),M27)>0,E27-IF(OR(B27=2,B27=3),M27),0)","v":{"v":0,"d":"0.00 €"}},{"$f":"LOOKUP(B27,G75:G81,H75:H81)","v":0},{"$f":"IF(O27-N27-L27>0,O27-N27-L27,0)","v":0}]
[{"$nulls":3},"von PKH-Partei gezahlter Unterhalt",{"v":0,"d":"0.00 €"}]
[]
[{"$nulls":3},"Mehrbedarfe gem. § 115 I Nr. 4 ZPO4",{"$f":"Mehrbedarf!D23","v":{"v":0,"d":"0.00 €"}},{"$f":"E30","v":{"v":0,"d":"0.00 €"}}]
[]
[{"$nulls":3},"Kosten der Unterkunft/Heizung; Nebenkosten",{"$f":"Details!B32","v":{"v":0,"d":"0.00 €"}},{"$f":"E32","v":{"v":0,"d":"0.00 €"}}]
[]
[{"$nulls":3},"Abzahlungsverpflichtung",{"v":0,"d":"0.00 €"},{"$f":"SUM(E34:E36)","v":{"v":0,"d":"0.00 €"}}]
[{"$nulls":3},"Abzahlungsverpflichtung",{"v":0,"d":"0.00 €"}]
[{"$nulls":3},"Abzahlungsverpflichtung",{"v":0,"d":"0.00 €"}]
[]
[{"$nulls":4},"verbleibendes Einkommen (gerundet):",{"$f":"TRUNC(F12-(SUM(F14:F36)))","v":{"v":-901,"d":"-901.00 €"}}]
[null,{"$f":"SUM(J27,J24,J21)","v":0}]
[{"$nulls":5},{"v":2,"d":"2.00"}]
{"$rows_left_out":50}
{"sheet":"Details","index":2,"n_rows":32,"n_cols":6,"rows_kept":32,"hidden":true}
[]
["Berechnung Durchschnittseinkommen:"]
[]
["Monat","Einkommen","sonst. Einn.","Steuern","Sozialvers.","Netto"]
["Januar",{"$nulls":4},{"$f":"IF(ISBLANK(B5),\"\",B5+C5-D5-E5)","v":""}]
["Februar",{"$nulls":4},{"$f":"IF(ISBLANK(B6),\"\",B6+C6-D6-E6)","v":""}]
["März",{"$nulls":4},""]
["April",{"$nulls":4},""]
["Mai",{"$nulls":4},""]
["Juni",{"$nulls":4},""]
["Juli",{"$nulls":4},""]
["August",{"$nulls":4},""]
["September",{"$nulls":4},""]
["Oktober",{"$nulls":4},""]
["November",{"$nulls":4},""]
["Dezember",{"$nulls":4},""]
[{"$nulls":5},{"$f":"IF(ISERROR(AVERAGE(F5:F16)),\"\",AVERAGE(F5:F16))","v":""}]
[]
["Berechnung Kosten der Unterkunft und Heizung:"]
[]
["Kosten","Betrag"]
["Kaltmiete"]
["Grundsteuer"]
["Hausmeister"]
["Gebäudeversicherung"]
["Wasser/Abwasser"]
["Heizung"]
["sonstige NK"]
[]
[]
["Zinsen/Tilgung"]
[null,{"$f":"SUM(B22:B31)","v":{"v":0,"d":"0.00 €"}}]

{"sheet":"Mehrbedarf","index":3,"n_rows":63,"n_cols":12,"rows_kept":63}
[]
[null,"Mehrbedarfsberechnung gem. § 115 I Nr. 4 ZPO"]
[]
[null,"Regelbedarfsstufe der Partei",1,{"$f":"LOOKUP(C4,J5:J10,K5:K10)","v":{"v":563,"d":"563.00 €"}}]
[{"$nulls":8},"alleinstehend",1,{"$f":"Werte!C15","v":563},2.3]
[null,"Schwangerschaft? (voraussichtlichen Entbindungstermin angeben):",null,{"$f":"IF(ISBLANK(C6),0,(IF((DATEDIF(TODAY(),C6,\"D\")<196),D4*0.17,0)))","v":{"v":0,"d":"0.00 €"}},{"$nulls":4},"mit Lebensgef.",2,{"$f":"Werte!C16","v":506},2.3]
[null,"alleinerziehend?",1,{"$f":"IF(E7=FALSE,((LOOKUP(C7,J25:J33,K25:K33))/100*K5),((LOOKUP(C7,J25:J33,K25:K33))/100*K5)/2)","v":{"v":0,"d":"0.00 €"}},false,{"$nulls":3},"Vollj. ohne Haushalt",3,{"$f":"Werte!C17","v":451},2.3]
[{"$nulls":8},"14 J. bis <18 J.",4,{"$f":"Werte!C18","v":471},1.4]
[null,"erwerbsfähig und Behinderung und Eingliederungshilfe?",false,{"$f":"IF(C9=TRUE,D4*0.35,0)","v":{"v":0,"d":"0.00 €"}},{"$nulls":4},"6 J. bis <14 J.",5,270,1.2]
[null,"Behinderung mit Merkzeichen \"G\"? (Geburtsdatum angeben):",null,{"$f":"IF(ISBLANK(C10),0,IF(OR(TODAY()>F11,C11=TRUE),D4*0.17,0))","v":{"v":0,"d":"0.00 €"}},null,{"$f":"LOOKUP((YEAR(C10)),I35:I54,J35:J54)","v":0},null,null,"< 6 J.",6,{"$f":"Werte!C20","v":357},0.8]
[null,"und voller Erwerbsminderung",false,null,null,{"$f":"DATE(YEAR(C10)+65,MONTH(C10)+F10,DAY(C10))","v":"1964-12-31"}]
[]
[null,"Warmwassererzeugung dezentral?",false,{"$f":"IF(C13=TRUE,(LOOKUP(C4,J5:J10,L5:L10))*D4/100,0)","v":{"v":0,"d":"0.00 €"}}]
[]
[null,"Mehrbedarf für kostenaufwändige Ernährung",1,{"$f":"(LOOKUP(C15,J56:J63,K56:K63))/100*D4","v":{"v":0,"d":"0.00 €"}},1]
[null,"Mehrbedarf für kostenaufwändige Ernährung (andere Erkrankung)/ sonstiger Mehrbedarf",null,{"v":0,"d":"0.00 €"}]
[null,"Pflege- und Hygieneartikel, die aus gesundheitlichen Gründen laufend benötigt werden",null,{"v":0,"d":"0.00 €"}]
[null,"Putz-/Haushaltshilfe (körperlich stark beeinträchtigte Personen), soweit nicht anders erstattet",null,{"v":0,"d":"0.00 €"}]
[]
[null,"Kosten zur Wahrnehmung des Umgangsrechts: (Fahrstrecke Kfz in km)",0,{"$f":"C20*0.2","v":{"v":0,"d":"0.00 €"}}]
[null,"oder Kosten bei Nutzung öffentlicher VM"]
[]
[null,null,"Mehrbedarf:",{"$f":"IF(SUM(D6:D22)>D4,D4,SUM(D6:D22))","v":{"v":0,"d":"0.00 €"}},{"$f":"IF(SUM(D6:D22)>D4,2,\"\")","v":""}]
[]
[{"$nulls":8},"nein",1,0]
[1,"nach den Empfehlungen des Deutschen Vereins für öffentliche und private Fürsorge (DV)",{"$nulls":6},"1 Kind < 7 J.",2,36]
[{"$f":"IF(SUM(D6:D22)>D4,\"2\",\"\")","v":""},{"$f":"IF(SUM(D6:D22)>D4,\"Summe des insgesamt anerkannten Mehrbedarfs in Höhe des Regelbedarfs gedeckelt\",\"\")","v":""},{"$nulls":6},"1 Kind > 7 J.",3,12]
[{"$nulls":8},"2 Kinder < 16 J.",4,36]
[{"$nulls":8},"2 Kinder > 16 J.",5,24]
[{"$nulls":8},"1 Kind > 7 J. + 1 Kind > 16 J.",6,24]
[{"$nulls":8},"3 Kinder",7,36]
[{"$nulls":8},"4 Kinder",8,48]
[{"$nulls":8},"5 Kinder",9,60]
[]
[{"$nulls":8},1900,0]
[{"$nulls":8},1947,1]
[{"$nulls":8},1948,2]
[{"$nulls":8},1949,3]
[{"$nulls":8},1950,4]
[{"$nulls":8},1951,5]
{"$rows_left_out":24}
{"sheet":"Werte","index":4,"n_rows":139,"n_cols":47,"rows_kept":139,"hidden":true}
[null,"Basiswerte Stand ","2025-01-01"]
[]
[null,1,"ausgewählter Wert","Bund","FFB","M (Land)","M (Stadt)","Bund"]
["Freibeträge § 115 ZPO:","Erwerbstätigkeit",{"$f":"INDEX(D4:G4,1,$B$3)","v":{"v":282,"d":"282.00 €"}},{"v":282,"d":"282.00 €"},{"v":295,"d":"295.00 €"},{"v":290,"d":"290.00 €"},{"v":296,"d":"296.00 €"},"FFB"]
[null,"Partei/Ehegatte",{"$f":"INDEX(D5:G5,1,$B$3)","v":{"v":619,"d":"619.00 €"}},{"v":619,"d":"619.00 €"},{"v":649,"d":"649.00 €"},{"v":637,"d":"637.00 €"},{"v":650,"d":"650.00 €"},"M (Land)"]
[null,"Kinder bis zur Vollendung des 6. Lebensjahres",{"v":393,"d":"393.00 €"},{"v":393,"d":"393.00 €"},{"v":408,"d":"408.00 €"},{"v":404,"d":"404.00 €"},{"v":407,"d":"407.00 €"},"M (Stadt)"]
[null,"Kinder vom 7. bis zur Vollendung des 14. Lebensjahres",{"v":429,"d":"429.00 €"},{"v":429,"d":"429.00 €"},{"v":443,"d":"443.00 €"},{"v":441,"d":"441.00 €"},{"v":446,"d":"446.00 €"}]
[null,"Jugendliche vom Beginn des 15. bis zur Vollendung des 18. Lebensjahres",{"v":518,"d":"518.00 €"},{"v":518,"d":"518.00 €"},{"v":540,"d":"540.00 €"},{"v":534,"d":"534.00 €"},{"v":541,"d":"541.00 €"}]
[null,"Erwachsene.",{"v":496,"d":"496.00 €"},{"v":496,"d":"496.00 €"},{"v":520,"d":"520.00 €"},{"v":510,"d":"510.00 €"},{"v":519,"d":"519.00 €"}]
[]
["Kindergeld:",null,{"v":259,"d":"259.00 €"},"1.+ 2. Kind"]
[null,null,{"v":259,"d":"259.00 €"},"3. Kind"]
[null,null,{"v":259,"d":"259.00 €"},"4. Kind und weitere"]
[]
["Regelbedarfsstufen",null,{"v":563,"d":"563.00 €"},"alleinstehend"]
[null,null,{"v":506,"d":"506.00 €"},"mit Lebensgef."]
[null,null,{"v":451,"d":"451.00 €"},"18 J. bis <25 J."]
[null,null,{"v":471,"d":"471.00 €"},"14 J. bis <18 J."]
[null,null,{"v":390,"d":"390.00 €"},"6 J. bis <14 J."]
[null,null,{"v":357,"d":"357.00 €"},"< 6 J."]
[]
["Bezugsgröße gem. §18 SGB IV",null,{"v":3955,"d":"3,955.00 €"},"alte BL"]
[null,null,{"v":3955,"d":"3,955.00 €"},"neue BL"]
[]
["Rundfunkbeitrag",null,{"v":18.36,"d":"18.36 €"}]
[]
[]
["Zivilsachen",null,"I. In.u.MahnVerf.","I. In.u.MahnVerf.",null,"I. In.o.MahnVerf.","I. In.o.MahnVerf.","II. In.","Haupts. Ehe","Haupts. Fam.streits.","Haupts. Kinds.s.","Haupts. übrige","eAO Kinds.s.","eAO übrige","Haupts. Ehe","Haupts. Fam.streits.","Haupts. Kinds.s.","Haupts. übrige","eAO Kinds.s.","eAO übrige"]
["Familiensachen","SW","GKG","GKG + RVG",null,"GKG","GKG +  RVG","GKG + RVG","FamGKG","FamGKG","FamGKG","FamGKG","FamGKG","FamGKG","FamGKG + RVG","FamGKG + RVG","FamGKG + RVG","FamGKG + RVG","FamGKG + RVG","FamGKG + RVG"]
[null,null,{"$f":"C28&\" (\"&C29&\")\"","v":"I. In.u.MahnVerf. (GKG)"},{"$f":"D28&\" (\"&D29&\")\"","v":"I. In.u.MahnVerf. (GKG + RVG)"},null,"I. In.o.MahnVerf. (GKG)","I. In.o.MahnVerf. (GKG +  RVG)","II. In. (GKG + RVG)","Haupts. Ehe (FamGKG)","Haupts. Fam.streits. (FamGKG)","Haupts. Kinds.s. (FamGKG)","Haupts. übrige (FamGKG)","eAO Kinds.s. (FamGKG)","eAO übrige (FamGKG)","Haupts. Ehe (FamGKG + RVG)","Haupts. Fam.streits. (FamGKG + RVG)","Haupts. Kinds.s. (FamGKG + RVG)","Haupts. übrige (FamGKG + RVG)","eAO Kinds.s. (FamGKG + RVG)","eAO übrige (FamGKG + RVG)"]
[null,500,78,248,null,114,284,340,76,114,19,76,15,57,246,284,189,246,185,227]
[null,{"v":1000,"d":"1,000"},138,424,null,174,460,550,116,174,29,116,17,87,402,460,315,402,303,373]
[null,{"v":1500,"d":"1,500"},195,597,null,234,636,759,156,234,39,156,23,117,558,636,441,558,426,519]
[null,{"v":2000,"d":"2,000"},245,763,null,294,812,969,196,294,49,196,29,147,714,812,567,714,548,665]
[null,{"v":3000,"d":"3,000"},298,982,null,357,{"v":1042,"d":"1,042"},{"v":1240,"d":"1,240"},238,357,60,238,36,179,923,{"v":1042,"d":"1,042"},744,923,720,863]
[null,{"v":4000,"d":"4,000"},350,{"v":1201,"d":"1,201"},null,420,{"v":1271,"d":"1,271"},{"v":1511,"d":"1,511"},280,420,70,280,42,210,{"v":1131,"d":"1,131"},{"v":1271,"d":"1,271"},921,{"v":1131,"d":"1,131"},893,{"v":1061,"d":"1,061"}]
[null,{"v":5000,"d":"5,000"},403,{"v":1420,"d":"1,420"},null,483,{"v":1501,"d":"1,501"},{"v":1781,"d":"1,781"},322,483,81,322,48,242,{"v":1340,"d":"1,340"},{"v":1501,"d":"1,501"},{"v":1098,"d":"1,098"},{"v":1340,"d":"1,340"},{"v":1066,"d":"1,066"},{"v":1259,"d":"1,259"}]
[null,{"v":6000,"d":"6,000"},455,{"v":1640,"d":"1,640"},null,546,{"v":1731,"d":"1,731"},{"v":2052,"d":"2,052"},364,546,91,364,55,273,{"v":1549,"d":"1,549"},{"v":1731,"d":"1,731"},{"v":1276,"d":"1,276"},{"v":1549,"d":"1,549"},{"v":1239,"d":"1,239"},{"v":1458,"d":"1,458"}]
[null,{"v":7000,"d":"7,000"},508,{"v":1859,"d":"1,859"},null,609,{"v":1960,"d":"1,960"},{"v":2322,"d":"2,322"},406,609,102,406,61,305,{"v":1757,"d":"1,757"},{"v":1960,"d":"1,960"},{"v":1453,"d":"1,453"},{"v":1757,"d":"1,757"},{"v":1412,"d":"1,412"},{"v":1656,"d":"1,656"}]
[null,{"v":8000,"d":"8,000"},560,{"v":2078,"d":"2,078"},null,672,{"v":2190,"d":"2,190"},{"v":2593,"d":"2,593"},448,672,112,448,67,336,{"v":1966,"d":"1,966"},{"v":2190,"d":"2,190"},{"v":1630,"d":"1,630"},{"v":1966,"d":"1,966"},{"v":1585,"d":"1,585"},{"v":1854,"d":"1,854"}]
{"$rows_left_out":99}